Reaction Details
TargetAcetylcholinesterase
LigandBDBM8961
Substrate/Competitorn/a
Meas. Tech.ChEMBL_854817 (CHEMBL2162062)
Ki 32±n/a nM
Citation Peng, DYSun, QZhu, XLLin, HYChen, QYu, NXYang, WCYang, GF Design, synthesis, and bioevaluation of benzamides: novel acetylcholinesterase inhibitors with multi-functions on butylcholinesterase, Aß aggregation, andß-secretase. Bioorg Med Chem20:6739-50 (2012) 
 
Acetylcholinesterase
Name:Acetylcholinesterase
Type:Enzyme
Mol. Mass.:67792.70
Organism:Homo sapiens (Human)
Description:P22303
Residue:614
BDBM8961
NameBDBM8961
Synonyms:1,2,3,4-tetrahydro-9-acridinamine 9-THA CHEMBL1337960 Cognex Tracine cid_1935 | tacrine.HCl
TypeSmall organic molecule
Emp. Form.C13H14N2
Mol. Mass.198.2637
SMILESNc1c2CCCCc2nc2ccccc12