Reaction Details
TargetSodium/glucose cotransporter 1
LigandBDBM20875
Substrate/Competitorn/a
Meas. Tech.ChEMBL_856133 (CHEMBL2162521)
IC50 536±n/a nM
Citation Fushimi, NFujikura, HShiohara, HTeranishi, HShimizu, KYonekubo, SOhno, KMiyagi, TItoh, FShibazaki, TTomae, MIshikawa-Takemura, YNakabayashi, TKamada, NOzawa, TKobayashi, SIsaji, M Structure-activity relationship studies of 4-benzyl-1H-pyrazol-3-ylß-d-glucopyranoside derivatives as potent and selective sodium glucose co-transporter 1 (SGLT1) inhibitors with therapeutic activity on postprandial hyperglycemia. Bioorg Med Chem20:6598-612 (2012) 
 
Sodium/glucose cotransporter 1
Name:Sodium/glucose cotransporter 1
Type:Protein
Mol. Mass.:73503.78
Organism:Homo sapiens (Human)
Description:P13866
Residue:664
BDBM20875
NameBDBM20875
Synonyms:1-(2,4-dihydroxy-6-{[(2S,3R,4S,5S,6R)-3,4,5-trihydroxy-6-(hydroxymethyl)oxan-2-yl]oxy}phenyl)-3-(4-hydroxyphenyl)propan-1-one CHEMBL245067 O-glucoside, 1 | Phlorizin
TypeNatural product
Emp. Form.C21H24O10
Mol. Mass.436.4093
SMILESOC[C@H]1O[C@@H](Oc2cc(O)cc(O)c2C(=O)CCc2ccc(O)cc2)[C@H](O)[C@@H](O)[C@@H]1O