Reaction Details
TargetCannabinoid receptor 1
LigandBDBM50261202
Substrate/Competitorn/a
Meas. Tech.ChEMBL_856761 (CHEMBL2162729)
EC50 6950±n/a nM
Citation Rizzo, STarozzi, ABartolini, MDa Costa, GBisi, AGobbi, SBelluti, FLigresti, AAllarà, MMonti, JPAndrisano, VDi Marzo, VHrelia, PRampa, A 2-Arylbenzofuran-based molecules as multipotent Alzheimer's disease modifying agents. Eur J Med Chem58:519-32 (2012) 
 
Cannabinoid receptor 1
Name:Cannabinoid receptor 1
Type:G Protein-Coupled Receptor (GPCR)
Mol. Mass.:52868.96
Organism:Homo sapiens (Human)
Description:P21554
Residue:472
BDBM50261202
NameBDBM50261202
Synonyms:CHEMBL497755 | [7-(4-Benzofuran-2-yl-phenoxy)hephtyl]benzylmethylamine
TypeSmall organic molecule
Emp. Form.C29H33NO2
Mol. Mass.427.5778
SMILESCN(CCCCCCCOc1ccc(cc1)-c1cc2ccccc2o1)Cc1ccccc1