Reaction Details
TargetCholinesterase
LigandBDBM50394566
Substrate/Competitorn/a
Meas. Tech.ChEMBL_856750 (CHEMBL2162576)
IC50 400±n/a nM
Citation Rizzo, STarozzi, ABartolini, MDa Costa, GBisi, AGobbi, SBelluti, FLigresti, AAllarà, MMonti, JPAndrisano, VDi Marzo, VHrelia, PRampa, A 2-Arylbenzofuran-based molecules as multipotent Alzheimer's disease modifying agents. Eur J Med Chem58:519-32 (2012) 
 
Cholinesterase
Name:Cholinesterase
Type:Homotetramer
Mol. Mass.:68422.27
Organism:Homo sapiens (Human)
Description:P06276
Residue:602
BDBM50394566
NameBDBM50394566
Synonyms:CHEMBL2160228
TypeSmall organic molecule
Emp. Form.C37H39NO3
Mol. Mass.545.7105
SMILESCN(CCCCCCCOc1cccc(c1)-c1oc2ccccc2c1C(=O)c1cccc(C)c1)Cc1ccccc1