Reaction Details
TargetCannabinoid receptor 2
LigandBDBM50394568
Substrate/Competitorn/a
Meas. Tech.ChEMBL_856764 (CHEMBL2162732)
Ki 690±n/a nM
Citation Rizzo, STarozzi, ABartolini, MDa Costa, GBisi, AGobbi, SBelluti, FLigresti, AAllarà, MMonti, JPAndrisano, VDi Marzo, VHrelia, PRampa, A 2-Arylbenzofuran-based molecules as multipotent Alzheimer's disease modifying agents. Eur J Med Chem58:519-32 (2012) 
 
Cannabinoid receptor 2
Name:Cannabinoid receptor 2
Type:G Protein-Coupled Receptor (GPCR)
Mol. Mass.:39690.94
Organism:Homo sapiens (Human)
Description:P34972
Residue:360
BDBM50394568
NameBDBM50394568
Synonyms:CHEMBL2160223
TypeSmall organic molecule
Emp. Form.C42H50N2O4
Mol. Mass.646.8574
SMILESCCN(CC)CCOc1cccc(c1)C(=O)c1c(oc2ccccc12)-c1ccc(OCCCCCCCN(C)Cc2ccccc2)cc1