Reaction Details
TargetCholinesterase
LigandBDBM50394565
Substrate/Competitorn/a
Meas. Tech.ChEMBL_856750 (CHEMBL2162576)
IC50 880±n/a nM
Citation Rizzo, STarozzi, ABartolini, MDa Costa, GBisi, AGobbi, SBelluti, FLigresti, AAllarà, MMonti, JPAndrisano, VDi Marzo, VHrelia, PRampa, A 2-Arylbenzofuran-based molecules as multipotent Alzheimer's disease modifying agents. Eur J Med Chem58:519-32 (2012) 
 
Cholinesterase
Name:Cholinesterase
Type:Homotetramer
Mol. Mass.:68422.27
Organism:Homo sapiens (Human)
Description:P06276
Residue:602
BDBM50394565
NameBDBM50394565
Synonyms:CHEMBL2160226
TypeSmall organic molecule
Emp. Form.C39H42N2O5
Mol. Mass.618.7612
SMILESCNC(=O)Oc1cccc(CN(C)CCCCCCCOc2ccc(cc2)-c2oc3ccccc3c2C(=O)c2ccc(C)cc2)c1