Reaction Details
TargetCannabinoid receptor 1
LigandBDBM50394567
Substrate/Competitorn/a
Meas. Tech.ChEMBL_856761 (CHEMBL2162729)
EC50 1370±n/a nM
Citation Rizzo, STarozzi, ABartolini, MDa Costa, GBisi, AGobbi, SBelluti, FLigresti, AAllarà, MMonti, JPAndrisano, VDi Marzo, VHrelia, PRampa, A 2-Arylbenzofuran-based molecules as multipotent Alzheimer's disease modifying agents. Eur J Med Chem58:519-32 (2012) 
 
Cannabinoid receptor 1
Name:Cannabinoid receptor 1
Type:G Protein-Coupled Receptor (GPCR)
Mol. Mass.:52868.96
Organism:Homo sapiens (Human)
Description:P21554
Residue:472
BDBM50394567
NameBDBM50394567
Synonyms:CHEMBL2160225
TypeSmall organic molecule
Emp. Form.C42H48N2O5
Mol. Mass.660.8409
SMILESCN(CCCCCCCOc1ccc(cc1)-c1oc2ccccc2c1C(=O)c1ccc(OCCN2CCOCC2)cc1)Cc1ccccc1