Reaction Details
TargetCholinesterase
LigandBDBM50394573
Substrate/Competitorn/a
Meas. Tech.ChEMBL_856750 (CHEMBL2162576)
IC50 1970±n/a nM
Citation Rizzo, STarozzi, ABartolini, MDa Costa, GBisi, AGobbi, SBelluti, FLigresti, AAllarà, MMonti, JPAndrisano, VDi Marzo, VHrelia, PRampa, A 2-Arylbenzofuran-based molecules as multipotent Alzheimer's disease modifying agents. Eur J Med Chem58:519-32 (2012) 
 
Cholinesterase
Name:Cholinesterase
Type:Homotetramer
Mol. Mass.:68422.27
Organism:Homo sapiens (Human)
Description:P06276
Residue:602
BDBM50394573
NameBDBM50394573
Synonyms:CHEMBL2160230
TypeSmall organic molecule
Emp. Form.C37H39NO4
Mol. Mass.561.7099
SMILESCOc1ccccc1C(=O)c1c(oc2ccccc12)-c1cccc(OCCCCCCCN(C)Cc2ccccc2)c1