Reaction Details
TargetAcetylcholinesterase
LigandBDBM50394577
Substrate/Competitorn/a
Meas. Tech.ChEMBL_856751 (CHEMBL2162577)
IC50 53000±n/a nM
Citation Rizzo, STarozzi, ABartolini, MDa Costa, GBisi, AGobbi, SBelluti, FLigresti, AAllarà, MMonti, JPAndrisano, VDi Marzo, VHrelia, PRampa, A 2-Arylbenzofuran-based molecules as multipotent Alzheimer's disease modifying agents. Eur J Med Chem58:519-32 (2012) 
 
Acetylcholinesterase
Name:Acetylcholinesterase
Type:Enzyme
Mol. Mass.:67792.70
Organism:Homo sapiens (Human)
Description:P22303
Residue:614
BDBM50394577
NameBDBM50394577
Synonyms:CHEMBL2160221
TypeSmall organic molecule
Emp. Form.C41H48N2O3
Mol. Mass.616.8314
SMILESCCN(CC)Cc1cccc(c1)C(=O)c1c(oc2ccccc12)-c1ccc(OCCCCCCCN(C)Cc2ccccc2)cc1