Reaction Details
TargetAcetylcholinesterase
LigandBDBM50394582
Substrate/Competitorn/a
Meas. Tech.ChEMBL_856751 (CHEMBL2162577)
IC50 67700±n/a nM
Citation Rizzo, STarozzi, ABartolini, MDa Costa, GBisi, AGobbi, SBelluti, FLigresti, AAllarà, MMonti, JPAndrisano, VDi Marzo, VHrelia, PRampa, A 2-Arylbenzofuran-based molecules as multipotent Alzheimer's disease modifying agents. Eur J Med Chem58:519-32 (2012) 
 
Acetylcholinesterase
Name:Acetylcholinesterase
Type:Enzyme
Mol. Mass.:67792.70
Organism:Homo sapiens (Human)
Description:P22303
Residue:614
BDBM50394582
NameBDBM50394582
Synonyms:CHEMBL2160220
TypeSmall organic molecule
Emp. Form.C44H41NO3
Mol. Mass.631.8012
SMILESCN(CCCCCCCOc1ccc(cc1)-c1oc2ccccc2c1C(=O)c1c2ccccc2cc2ccccc12)Cc1ccccc1