Reaction Details
TargetAcetylcholinesterase
LigandBDBM50394578
Substrate/Competitorn/a
Meas. Tech.ChEMBL_856751 (CHEMBL2162577)
IC50 215000±n/a nM
Citation Rizzo, STarozzi, ABartolini, MDa Costa, GBisi, AGobbi, SBelluti, FLigresti, AAllarà, MMonti, JPAndrisano, VDi Marzo, VHrelia, PRampa, A 2-Arylbenzofuran-based molecules as multipotent Alzheimer's disease modifying agents. Eur J Med Chem58:519-32 (2012) 
 
Acetylcholinesterase
Name:Acetylcholinesterase
Type:Enzyme
Mol. Mass.:67792.70
Organism:Homo sapiens (Human)
Description:P22303
Residue:614
BDBM50394578
NameBDBM50394578
Synonyms:CHEMBL2160213
TypeSmall organic molecule
Emp. Form.C27H29NO2
Mol. Mass.399.5247
SMILESCN(CCCCCOc1ccc(cc1)-c1cc2ccccc2o1)Cc1ccccc1