Reaction Details
TargetC-C chemokine receptor type 5
LigandBDBM50394599
Substrate/Competitorn/a
Meas. Tech.ChEMBL_857678 (CHEMBL2168514)
IC50 0.4±n/a nM
Citation Skerlj, RBridger, GZhou, YBourque, EMcEachern, EDanthi, SLangille, JHarwig, CVeale, DCarpenter, BBa, TBey, MBaird, IWilson, TMetz, MMacFarland, RMosi, RBodart, VWong, RFricker, SHuskens, DSchols, D Mitigating hERG Inhibition: Design of Orally Bioavailable CCR5 Antagonists as Potent Inhibitors of R5 HIV-1 Replication. ACS Med Chem Lett3:216-221 (2012) 
 
C-C chemokine receptor type 5
Name:C-C chemokine receptor type 5
Type:Enzyme
Mol. Mass.:40540.21
Organism:Homo sapiens (Human)
Description:P51681
Residue:352
BDBM50394599
NameBDBM50394599
Synonyms:CHEMBL2164219
TypeSmall organic molecule
Emp. Form.C25H35ClN4O3S
Mol. Mass.507.088
SMILESCOCC(=O)N(Cc1ccsc1)C1CCN(CC1)[C@H](C)CCNC(=O)c1c(C)cc(Cl)nc1C