Reaction Details
TargetDNA polymerase beta
LigandBDBM50346601
Substrate/Competitorn/a
Meas. Tech.ChEMBL_857771 (CHEMBL2169014)
IC50 3000±n/a nM
Citation Takemura, MEndo, SMatsunaga, TSoda, MZhao, HTEl-Kabbani, OTajima, KIinuma, MHara, A Selective inhibition of the tumor marker aldo-keto reductase family member 1B10 by oleanolic acid. J Nat Prod74:1201-6 (2011) 
 
DNA polymerase beta
Name:DNA polymerase beta
Type:Protein
Mol. Mass.:38188.76
Organism:Homo sapiens (Human)
Description:n/a
Residue:335
BDBM50346601
NameBDBM50346601
Synonyms:NSC-114945 Oleanolic acid US11660306, Example Oleanolic acid
TypeSmall organic molecule
Emp. Form.C30H48O3
Mol. Mass.456.7003
SMILESCC1(C)CC[C@@]2(CC[C@]3(C)C(=CC[C@@H]4[C@@]5(C)CC[C@H](O)C(C)(C)[C@@H]5CC[C@@]34C)[C@@H]2C1)C(O)=O