Reaction Details
TargetAldo-keto reductase family 1 member B10
LigandBDBM50148911
Substrate/Competitorn/a
Meas. Tech.ChEMBL_857756 (CHEMBL2168783)
Ki 2000±n/a nM
Citation Takemura, MEndo, SMatsunaga, TSoda, MZhao, HTEl-Kabbani, OTajima, KIinuma, MHara, A Selective inhibition of the tumor marker aldo-keto reductase family member 1B10 by oleanolic acid. J Nat Prod74:1201-6 (2011) 
 
Aldo-keto reductase family 1 member B10
Name:Aldo-keto reductase family 1 member B10
Type:Protein
Mol. Mass.:36024.67
Organism:Homo sapiens (Human)
Description:O60218. 1ZUA; 4JII; 4GQ0
Residue:316
BDBM50148911
NameBDBM50148911
Synonyms:(3beta)-3-hydroxyurs-12-en-28-oic acid CHEMBL169 malol urson
TypeSmall organic molecule
Emp. Form.C30H48O3
Mol. Mass.456.7003
SMILESC[C@@H]1CC[C@@]2(CC[C@]3(C)C(=CC[C@@H]4[C@@]5(C)CC[C@H](O)C(C)(C)[C@@H]5CC[C@@]34C)[C@@H]2[C@H]1C)C(O)=O