Reaction Details
TargetAldo-keto reductase family 1 member B10
LigandBDBM23208
Substrate/Competitorn/a
Meas. Tech.ChEMBL_857753 (CHEMBL2168780)
IC50 2000±n/a nM
Citation Takemura, MEndo, SMatsunaga, TSoda, MZhao, HTEl-Kabbani, OTajima, KIinuma, MHara, A Selective inhibition of the tumor marker aldo-keto reductase family member 1B10 by oleanolic acid. J Nat Prod74:1201-6 (2011) 
 
Aldo-keto reductase family 1 member B10
Name:Aldo-keto reductase family 1 member B10
Type:Protein
Mol. Mass.:36024.67
Organism:Homo sapiens (Human)
Description:O60218. 1ZUA; 4JII; 4GQ0
Residue:316
BDBM23208
NameBDBM23208
Synonyms:(1R,2R,5S,8R,9R,10R,13R,14R,17S,19R)-17-hydroxy-1,2,14,18,18-pentamethyl-8-(prop-1-en-2-yl)pentacyclo[11.8.0.0^{2,10}.0^{5,9}.0^{14,19}]henicosane-5-carboxylic acid CHEMBL269277 | cid_64971
TypeTerpene
Emp. Form.C30H48O3
Mol. Mass.456.7003
SMILES[H][C@]12[C@@H](CC[C@@]1(CC[C@]1(C)[C@]2([H])CC[C@]2([H])[C@@]3(C)CC[C@H](O)C(C)(C)[C@]3([H])CC[C@@]12C)C(O)=O)C(C)=C