Reaction Details
TargetHistamine H2 receptor
LigandBDBM50394698
Substrate/Competitorn/a
Meas. Tech.ChEMBL_858640 (CHEMBL2166522)
EC50 0.39±n/a nM
Citation Birnkammer, TSpickenreither, ABrunskole, ILopuch, MKagermeier, NBernhardt, GDove, SSeifert, RElz, SBuschauer, A The bivalent ligand approach leads to highly potent and selective acylguanidine-type histamine H2 receptor agonists. J Med Chem55:1147-60 (2012) 
 
Histamine H2 receptor
Name:Histamine H2 receptor
Type:G Protein-Coupled Receptor (GPCR)
Mol. Mass.:40567.22
Organism:Cavia porcellus (domestic guinea pig)
Description:For the H2 receptor-binding assays, guinea pig striatum was used.
Residue:359
BDBM50394698
NameBDBM50394698
Synonyms:CHEMBL2165632
TypeSmall organic molecule
Emp. Form.C26H44N10O2S2
Mol. Mass.592.823
SMILESCc1nc(N)sc1CCCNC(=N)NC(=O)CCCCCCCCC(=O)NC(=N)NCCCc1sc(N)nc1C