Reaction Details
TargetHistamine H3 receptor
LigandBDBM50394706
Substrate/Competitorn/a
Meas. Tech.ChEMBL_858650 (CHEMBL2166532)
EC50 4.17±n/a nM
Citation Birnkammer, TSpickenreither, ABrunskole, ILopuch, MKagermeier, NBernhardt, GDove, SSeifert, RElz, SBuschauer, A The bivalent ligand approach leads to highly potent and selective acylguanidine-type histamine H2 receptor agonists. J Med Chem55:1147-60 (2012) 
 
Histamine H3 receptor
Name:Histamine H3 receptor
Type:G Protein-Coupled Receptor (GPCR)
Mol. Mass.:48691.47
Organism:Homo sapiens (Human)
Description:Binding assays were using CHO cells stably expressing hH3R receptors.
Residue:445
BDBM50394706
NameBDBM50394706
Synonyms:CHEMBL2165641
TypeSmall organic molecule
Emp. Form.C22H36N10O2
Mol. Mass.472.587
SMILESN=C(NCCCc1cnc[nH]1)NC(=O)CCCCCCC(=O)NC(=N)NCCCc1cnc[nH]1