Reaction Details
TargetHistamine H2 receptor
LigandBDBM50394709
Substrate/Competitorn/a
Meas. Tech.ChEMBL_858640 (CHEMBL2166522)
EC50 3.47±n/a nM
Citation Birnkammer, TSpickenreither, ABrunskole, ILopuch, MKagermeier, NBernhardt, GDove, SSeifert, RElz, SBuschauer, A The bivalent ligand approach leads to highly potent and selective acylguanidine-type histamine H2 receptor agonists. J Med Chem55:1147-60 (2012) 
 
Histamine H2 receptor
Name:Histamine H2 receptor
Type:G Protein-Coupled Receptor (GPCR)
Mol. Mass.:40567.22
Organism:Cavia porcellus (domestic guinea pig)
Description:For the H2 receptor-binding assays, guinea pig striatum was used.
Residue:359
BDBM50394709
NameBDBM50394709
Synonyms:CHEMBL2165645
TypeSmall organic molecule
Emp. Form.C25H42N10O2S2
Mol. Mass.578.797
SMILESCc1nc(N)sc1CCCN=C(N)NC(=O)CCCCCCCCC(=O)NC(N)=NCCCc1cnc(N)s1