Reaction Details
TargetHistamine H2 receptor
LigandBDBM50394706
Substrate/Competitorn/a
Meas. Tech.ChEMBL_858640 (CHEMBL2166522)
EC50 3.24±n/a nM
Citation Birnkammer, TSpickenreither, ABrunskole, ILopuch, MKagermeier, NBernhardt, GDove, SSeifert, RElz, SBuschauer, A The bivalent ligand approach leads to highly potent and selective acylguanidine-type histamine H2 receptor agonists. J Med Chem55:1147-60 (2012) 
 
Histamine H2 receptor
Name:Histamine H2 receptor
Type:G Protein-Coupled Receptor (GPCR)
Mol. Mass.:40567.22
Organism:Cavia porcellus (domestic guinea pig)
Description:For the H2 receptor-binding assays, guinea pig striatum was used.
Residue:359
BDBM50394706
NameBDBM50394706
Synonyms:CHEMBL2165641
TypeSmall organic molecule
Emp. Form.C22H36N10O2
Mol. Mass.472.587
SMILESN=C(NCCCc1cnc[nH]1)NC(=O)CCCCCCC(=O)NC(=N)NCCCc1cnc[nH]1