Reaction Details
TargetHistamine H2 receptor
LigandBDBM50394707
Substrate/Competitorn/a
Meas. Tech.ChEMBL_858640 (CHEMBL2166522)
EC50 10.96±n/a nM
Citation Birnkammer, TSpickenreither, ABrunskole, ILopuch, MKagermeier, NBernhardt, GDove, SSeifert, RElz, SBuschauer, A The bivalent ligand approach leads to highly potent and selective acylguanidine-type histamine H2 receptor agonists. J Med Chem55:1147-60 (2012) 
 
Histamine H2 receptor
Name:Histamine H2 receptor
Type:G Protein-Coupled Receptor (GPCR)
Mol. Mass.:40567.22
Organism:Cavia porcellus (domestic guinea pig)
Description:For the H2 receptor-binding assays, guinea pig striatum was used.
Residue:359
BDBM50394707
NameBDBM50394707
Synonyms:CHEMBL2165640
TypeSmall organic molecule
Emp. Form.C20H32N10O2
Mol. Mass.444.5339
SMILESN=C(NCCCc1cnc[nH]1)NC(=O)CCCCC(=O)NC(=N)NCCCc1cnc[nH]1