Reaction Details
TargetHistamine H2 receptor
LigandBDBM50394712
Substrate/Competitorn/a
Meas. Tech.ChEMBL_858640 (CHEMBL2166522)
EC50 5.01±n/a nM
Citation Birnkammer, TSpickenreither, ABrunskole, ILopuch, MKagermeier, NBernhardt, GDove, SSeifert, RElz, SBuschauer, A The bivalent ligand approach leads to highly potent and selective acylguanidine-type histamine H2 receptor agonists. J Med Chem55:1147-60 (2012) 
 
Histamine H2 receptor
Name:Histamine H2 receptor
Type:G Protein-Coupled Receptor (GPCR)
Mol. Mass.:40567.22
Organism:Cavia porcellus (domestic guinea pig)
Description:For the H2 receptor-binding assays, guinea pig striatum was used.
Residue:359
BDBM50394712
NameBDBM50394712
Synonyms:CHEMBL2165637
TypeSmall organic molecule
Emp. Form.C24H40N10O2S2
Mol. Mass.564.77
SMILESNC(NC(=O)CCCCCCCCC(=O)NC(=N)NCCCc1cnc(N)s1)=NCCCc1cnc(N)s1