Reaction Details
TargetHistamine H2 receptor
LigandBDBM50394713
Substrate/Competitorn/a
Meas. Tech.ChEMBL_858637 (CHEMBL2166519)
EC50 30.9±n/a nM
Citation Birnkammer, TSpickenreither, ABrunskole, ILopuch, MKagermeier, NBernhardt, GDove, SSeifert, RElz, SBuschauer, A The bivalent ligand approach leads to highly potent and selective acylguanidine-type histamine H2 receptor agonists. J Med Chem55:1147-60 (2012) 
 
Histamine H2 receptor
Name:Histamine H2 receptor
Type:G Protein-Coupled Receptor (GPCR)
Mol. Mass.:40115.31
Organism:Homo sapiens (Human)
Description:n/a
Residue:359
BDBM50394713
NameBDBM50394713
Synonyms:CHEMBL2165636
TypeSmall organic molecule
Emp. Form.C22H36N10O2S2
Mol. Mass.536.717
SMILESNC(NC(=O)CCCCCCC(=O)NC(N)=NCCCc1cnc(N)s1)=NCCCc1cnc(N)s1