Reaction Details
TargetHistamine H2 receptor
LigandBDBM50394696
Substrate/Competitorn/a
Meas. Tech.ChEMBL_858637 (CHEMBL2166519)
EC50 25.7±n/a nM
Citation Birnkammer, TSpickenreither, ABrunskole, ILopuch, MKagermeier, NBernhardt, GDove, SSeifert, RElz, SBuschauer, A The bivalent ligand approach leads to highly potent and selective acylguanidine-type histamine H2 receptor agonists. J Med Chem55:1147-60 (2012) 
 
Histamine H2 receptor
Name:Histamine H2 receptor
Type:G Protein-Coupled Receptor (GPCR)
Mol. Mass.:40115.31
Organism:Homo sapiens (Human)
Description:n/a
Residue:359
BDBM50394696
NameBDBM50394696
Synonyms:CHEMBL2165634
TypeSmall organic molecule
Emp. Form.C32H56N10O2S2
Mol. Mass.676.983
SMILESCc1nc(N)sc1CCCNC(=N)NC(=O)CCCCCCCCCCCCCCC(=O)NC(=N)NCCCc1sc(N)nc1C