Reaction Details
TargetHistamine H2 receptor
LigandBDBM22881
Substrate/Competitorn/a
Meas. Tech.ChEMBL_858637 (CHEMBL2166519)
EC50 190.55±n/a nM
Citation Birnkammer, TSpickenreither, ABrunskole, ILopuch, MKagermeier, NBernhardt, GDove, SSeifert, RElz, SBuschauer, A The bivalent ligand approach leads to highly potent and selective acylguanidine-type histamine H2 receptor agonists. J Med Chem55:1147-60 (2012) 
 
Histamine H2 receptor
Name:Histamine H2 receptor
Type:G Protein-Coupled Receptor (GPCR)
Mol. Mass.:40115.31
Organism:Homo sapiens (Human)
Description:n/a
Residue:359
BDBM22881
NameBDBM22881
Synonyms:5-(2-aminoethyl)-4-methyl-1,3-thiazol-2-amine CHEMBL554964
TypeSmall organic molecule
Emp. Form.C6H11N3S
Mol. Mass.157.237
SMILESCc1nc(N)sc1CCN