Reaction Details
TargetAdenosine receptor A2a
LigandBDBM50394722
Substrate/Competitorn/a
Meas. Tech.ChEMBL_858812 (CHEMBL2167687)
Ki 0.3±n/a nM
Citation Shook, BCRassnick, SWallace, NCrooke, JAult, MChakravarty, DBarbay, JKWang, APowell, MTLeonard, KAlford, VScannevin, RHCarroll, KLampron, LWestover, LLim, HKRussell, RBranum, SWells, KMDamon, SYouells, SLi, XBeauchamp, DARhodes, KJackson, PF Design and characterization of optimized adenosine A2A/A1 receptor antagonists for the treatment of Parkinson's disease. J Med Chem55:1402-17 (2012) 
 
Adenosine receptor A2a
Name:Adenosine receptor A2a
Type:G Protein-Coupled Receptor (GPCR)
Mol. Mass.:44716.46
Organism:Homo sapiens (Human)
Description:P29274
Residue:412
BDBM50394722
NameBDBM50394722
Synonyms:CHEMBL2165807
TypeSmall organic molecule
Emp. Form.C23H16N4O
Mol. Mass.364.3993
SMILESNc1nc2-c3cc(Cc4cccnc4)ccc3C(=O)c2c(n1)-c1ccccc1