Reaction Details
TargetPotassium voltage-gated channel subfamily H member 2
LigandBDBM50357687
Substrate/Competitorn/a
Meas. Tech.ChEMBL_859035 (CHEMBL2168855)
EC50 4700±n/a nM
Citation Ramnauth, JRenton, PDove, PAnnedi, SCSpeed, JSilverman, SMladenova, GMaddaford, SPZinghini, SRakhit, SAndrews, JLee, DKZhang, DPorreca, F 1,2,3,4-tetrahydroquinoline-based selective human neuronal nitric oxide synthase (nNOS) inhibitors: lead optimization studies resulting in the identification of N-(1-(2-(methylamino)ethyl)-1,2,3,4-tetrahydroquinolin-6-yl)thiophene-2-carboximidamide as a preclinical development candidate. J Med Chem55:2882-93 (2012) 
 
Potassium voltage-gated channel subfamily H member 2
Name:Potassium voltage-gated channel subfamily H member 2
Type:Multi-pass membrane protein
Mol. Mass.:126672.65
Organism:Homo sapiens (Human)
Description:Q12809
Residue:1159
BDBM50357687
NameBDBM50357687
Synonyms:CHEMBL1956112
TypeSmall organic molecule
Emp. Form.C21H28N4S
Mol. Mass.368.539
SMILESCN1CCC[C@H]1CCN1CCCc2cc(ccc12)N=C(N)c1cccs1