Reaction Details
TargetNitric oxide synthase, brain
LigandBDBM50394739
Substrate/Competitorn/a
Meas. Tech.ChEMBL_859158 (CHEMBL2169574)
IC50 115±n/a nM
Citation Ramnauth, JRenton, PDove, PAnnedi, SCSpeed, JSilverman, SMladenova, GMaddaford, SPZinghini, SRakhit, SAndrews, JLee, DKZhang, DPorreca, F 1,2,3,4-tetrahydroquinoline-based selective human neuronal nitric oxide synthase (nNOS) inhibitors: lead optimization studies resulting in the identification of N-(1-(2-(methylamino)ethyl)-1,2,3,4-tetrahydroquinolin-6-yl)thiophene-2-carboximidamide as a preclinical development candidate. J Med Chem55:2882-93 (2012) 
 
Nitric oxide synthase, brain
Name:Nitric oxide synthase, brain
Type:Homodimer
Mol. Mass.:160985.98
Organism:Homo sapiens (Human)
Description:P29475
Residue:1434
BDBM50394739
NameBDBM50394739
Synonyms:CHEMBL2165827
TypeSmall organic molecule
Emp. Form.C18H24N4OS
Mol. Mass.344.474
SMILESOCCNCCN1CCCc2cc(NC(=N)c3cccs3)ccc12