Reaction Details
TargetAurora kinase B
LigandBDBM50394801
Substrate/Competitorn/a
Meas. Tech.ChEMBL_859401 (CHEMBL2167307)
IC50 420±n/a nM
Citation Liu, GAbraham, STran, LVickers, TDXu, SHadd, MJQuiambao, SHolladay, MWHua, HFord Pulido, JMGunawardane, RNDavis, MIEichelberger, SRApuy, JLGitnick, DGardner, MFJames, JBreider, MABelli, BArmstrong, RCTreiber, DK Discovery of highly potent and selective pan-Aurora kinase inhibitors with enhanced in vivo antitumor therapeutic index. J Med Chem55:3250-60 (2012) 
 
Aurora kinase B
Name:Aurora kinase B
Type:Protein
Mol. Mass.:39327.72
Organism:Homo sapiens (Human)
Description:Q96GD4
Residue:344
BDBM50394801
NameBDBM50394801
Synonyms:CHEMBL2163405
TypeSmall organic molecule
Emp. Form.C22H24N8O2S
Mol. Mass.464.543
SMILESCc1cc(Nc2nc(Sc3ccc(NC(=O)CN4CC[C@H](O)C4)cc3)nn3cccc23)n[nH]1