Reaction Details
TargetAurora kinase B
LigandBDBM50394789
Substrate/Competitorn/a
Meas. Tech.ChEMBL_859401 (CHEMBL2167307)
IC50 12±n/a nM
Citation Liu, GAbraham, STran, LVickers, TDXu, SHadd, MJQuiambao, SHolladay, MWHua, HFord Pulido, JMGunawardane, RNDavis, MIEichelberger, SRApuy, JLGitnick, DGardner, MFJames, JBreider, MABelli, BArmstrong, RCTreiber, DK Discovery of highly potent and selective pan-Aurora kinase inhibitors with enhanced in vivo antitumor therapeutic index. J Med Chem55:3250-60 (2012) 
 
Aurora kinase B
Name:Aurora kinase B
Type:Protein
Mol. Mass.:39327.72
Organism:Homo sapiens (Human)
Description:Q96GD4
Residue:344
BDBM50394789
NameBDBM50394789
Synonyms:CHEMBL2163400
TypeSmall organic molecule
Emp. Form.C26H32N8O2S2
Mol. Mass.552.715
SMILESCc1cc(Nc2nc(Sc3ccc(NC(=O)CN4CC[C@H](C4)S(=O)C(C)(C)C)cc3)nn3cccc23)n[nH]1