Reaction Details
TargetAurora kinase A
LigandBDBM50394778
Substrate/Competitorn/a
Meas. Tech.ChEMBL_859403 (CHEMBL2167309)
Kd 4.2±n/a nM
Citation Liu, GAbraham, STran, LVickers, TDXu, SHadd, MJQuiambao, SHolladay, MWHua, HFord Pulido, JMGunawardane, RNDavis, MIEichelberger, SRApuy, JLGitnick, DGardner, MFJames, JBreider, MABelli, BArmstrong, RCTreiber, DK Discovery of highly potent and selective pan-Aurora kinase inhibitors with enhanced in vivo antitumor therapeutic index. J Med Chem55:3250-60 (2012) 
 
Aurora kinase A
Name:Aurora kinase A
Type:Serine/threonine-protein kinase
Mol. Mass.:45830.98
Organism:Homo sapiens (Human)
Description:O14965
Residue:403
BDBM50394778
NameBDBM50394778
Synonyms:CHEMBL2163395
TypeSmall organic molecule
Emp. Form.C27H31N9O2S
Mol. Mass.545.659
SMILESCc1cc(Nc2nc(Sc3ccc(NC(=O)CN4CC[C@H](C4)C(=O)NC4CCC4)cc3)nn3cccc23)n[nH]1