Reaction Details
TargetAurora kinase A
LigandBDBM50394801
Substrate/Competitorn/a
Meas. Tech.ChEMBL_859403 (CHEMBL2167309)
Kd 39±n/a nM
Citation Liu, GAbraham, STran, LVickers, TDXu, SHadd, MJQuiambao, SHolladay, MWHua, HFord Pulido, JMGunawardane, RNDavis, MIEichelberger, SRApuy, JLGitnick, DGardner, MFJames, JBreider, MABelli, BArmstrong, RCTreiber, DK Discovery of highly potent and selective pan-Aurora kinase inhibitors with enhanced in vivo antitumor therapeutic index. J Med Chem55:3250-60 (2012) 
 
Aurora kinase A
Name:Aurora kinase A
Type:Serine/threonine-protein kinase
Mol. Mass.:45830.98
Organism:Homo sapiens (Human)
Description:O14965
Residue:403
BDBM50394801
NameBDBM50394801
Synonyms:CHEMBL2163405
TypeSmall organic molecule
Emp. Form.C22H24N8O2S
Mol. Mass.464.543
SMILESCc1cc(Nc2nc(Sc3ccc(NC(=O)CN4CC[C@H](O)C4)cc3)nn3cccc23)n[nH]1