Reaction Details
TargetCytochrome P450 3A4
LigandBDBM50394815
Substrate/Competitorn/a
Meas. Tech.ChEMBL_859942 (CHEMBL2167345)
IC50 480±n/a nM
Citation Richards, SLarson, CJKoltun, ESHanel, AChan, VNachtigall, JHarrison, AAay, NDu, HArcalas, AGalan, AZhang, JZhang, WWon, KATam, DQian, FWang, TFinn, POgilvie, KRosen, JAoyama, RPlonowski, ACancilla, BBentzien, FYakes, MMohan, RLamb, PNuss, JKearney, P Discovery and characterization of an inhibitor of glucosylceramide synthase. J Med Chem55:4322-35 (2012) 
 
Cytochrome P450 3A4
Name:Cytochrome P450 3A4
Type:Enzyme
Mol. Mass.:57349.57
Organism:Homo sapiens (Human)
Description:n/a
Residue:503
BDBM50394815
NameBDBM50394815
Synonyms:CHEMBL2163834
TypeSmall organic molecule
Emp. Form.C24H26BrCl2N3O2
Mol. Mass.539.292
SMILESCN1CCN(CC1)C(=O)[C@H](Cc1ccc(Br)cc1)NC(=O)C1(CC1)c1ccc(Cl)cc1Cl