Reaction Details
TargetCeramide glucosyltransferase
LigandBDBM50394815
Substrate/Competitorn/a
Meas. Tech.ChEMBL_859946 (CHEMBL2167349)
IC50 14±n/a nM
Citation Richards, SLarson, CJKoltun, ESHanel, AChan, VNachtigall, JHarrison, AAay, NDu, HArcalas, AGalan, AZhang, JZhang, WWon, KATam, DQian, FWang, TFinn, POgilvie, KRosen, JAoyama, RPlonowski, ACancilla, BBentzien, FYakes, MMohan, RLamb, PNuss, JKearney, P Discovery and characterization of an inhibitor of glucosylceramide synthase. J Med Chem55:4322-35 (2012) 
 
Ceramide glucosyltransferase
Name:Ceramide glucosyltransferase
Type:PROTEIN
Mol. Mass.:44859.25
Organism:Homo sapiens (Human)
Description:ChEMBL_1435474
Residue:394
BDBM50394815
NameBDBM50394815
Synonyms:CHEMBL2163834
TypeSmall organic molecule
Emp. Form.C24H26BrCl2N3O2
Mol. Mass.539.292
SMILESCN1CCN(CC1)C(=O)[C@H](Cc1ccc(Br)cc1)NC(=O)C1(CC1)c1ccc(Cl)cc1Cl