Reaction Details
TargetLysosomal acid glucosylceramidase
LigandBDBM50394827
Substrate/Competitorn/a
Meas. Tech.ChEMBL_860089 (CHEMBL2168215)
Ki 1±n/a nM
Citation Trapero, AGonzález-Bulnes, PButters, TDLlebaria, A Potent aminocyclitol glucocerebrosidase inhibitors are subnanomolar pharmacological chaperones for treating gaucher disease. J Med Chem55:4479-88 (2012) 
 
Lysosomal acid glucosylceramidase
Name:Lysosomal acid glucosylceramidase
Type:Enzyme
Mol. Mass.:59724.64
Organism:Homo sapiens (Human)
Description:The beta-Glu activity was measured with commercially available beta-glucocerebrosidase (Ceredase) as the enzyme source.
Residue:536
BDBM50394827
NameBDBM50394827
Synonyms:CHEMBL2164231
TypeSmall organic molecule
Emp. Form.C24H49NO5
Mol. Mass.431.6496
SMILESCCCCCCCCCN[C@H]1[C@H](O)[C@@H](O)[C@H](O)[C@@H](O)[C@H]1OCCCCCCCCC