Reaction Details
TargetLanosterol synthase
LigandBDBM50128063
Substrate/Competitorn/a
Meas. Tech.ChEMBL_860118 (CHEMBL2168444)
IC50 2.9±n/a nM
Citation Staedler, DChapuis-Bernasconi, CDehmlow, HFischer, HJuillerat-Jeanneret, LAebi, JD Cytotoxic effects of combination of oxidosqualene cyclase inhibitors with atorvastatin in human cancer cells. J Med Chem55:4990-5002 (2012) 
 
Lanosterol synthase
Name:Lanosterol synthase
Type:PROTEIN
Mol. Mass.:83309.32
Organism:Homo sapiens (Human)
Description:ChEMBL_11231
Residue:732
BDBM50128063
NameBDBM50128063
Synonyms:Allyl-{6-[3-(4-bromo-phenyl)-benzo[d]isothiazol-6-yloxy]-hexyl}-methyl-amine CHEMBL67133 N-allyl-6-(3-(4-bromophenyl)benzo[d]isothiazol-6-yloxy)-N-methylhexan-1-aminium
TypeSmall organic molecule
Emp. Form.C23H27BrN2OS
Mol. Mass.459.442
SMILESCN(CCCCCCOc1ccc2c(nsc2c1)-c1ccc(Br)cc1)CC=C