Reaction Details
TargetSolute carrier organic anion transporter family member 1B3
LigandBDBM13934
Substrate/Competitorn/a
Meas. Tech.ChEMBL_860287 (CHEMBL2169433)
Ki 370±n/a nM
Citation Karlgren, MVildhede, ANorinder, UWisniewski, JRKimoto, ELai, YHaglund, UArtursson, P Classification of inhibitors of hepatic organic anion transporting polypeptides (OATPs): influence of protein expression on drug-drug interactions. J Med Chem55:4740-63 (2012) 
 
Solute carrier organic anion transporter family member 1B3
Name:Solute carrier organic anion transporter family member 1B3
Type:Protein
Mol. Mass.:77425.75
Organism:Homo sapiens (Human)
Description:Q9NPD5
Residue:702
BDBM13934
NameBDBM13934
Synonyms:Atazanavir CGP 73547 Latazanavir methyl N-[(1S)-1-[[(2S,3S)-3-hydroxy-4-[[[(2S)-2-(methoxycarbonylamino)-3,3-dimethyl-butanoyl]amino]-[(4-pyridin-2-ylphenyl)methyl]amino]-1-phenyl-butan-2-yl]carbamoyl]-2,2-dimethyl-propyl]carbamate | methyl N-[(1S)-1-{[(2S,3S)-3-hydroxy-4-[(2S)-2-[(methoxycarbonyl)amino]-3,3-dimethyl-N'-{[4-(pyridin-2-yl)phenyl]methyl}butanehydrazido]-1-phenylbutan-2-yl]carbamoyl}-2,2-dimethylpropyl]carbamate
TypeSmall organic molecule
Emp. Form.C38H52N6O7
Mol. Mass.704.8555
SMILESCOC(=O)N[C@H](C(=O)N[C@@H](Cc1ccccc1)[C@@H](O)CN(Cc1ccc(cc1)-c1ccccn1)NC(=O)[C@@H](NC(=O)OC)C(C)(C)C)C(C)(C)C