Reaction Details
TargetSolute carrier organic anion transporter family member 1B1
LigandBDBM50097125
Substrate/Competitorn/a
Meas. Tech.ChEMBL_860286 (CHEMBL2169432)
IC50 560±n/a nM
Citation Karlgren, MVildhede, ANorinder, UWisniewski, JRKimoto, ELai, YHaglund, UArtursson, P Classification of inhibitors of hepatic organic anion transporting polypeptides (OATPs): influence of protein expression on drug-drug interactions. J Med Chem55:4740-63 (2012) 
 
Solute carrier organic anion transporter family member 1B1
Name:Solute carrier organic anion transporter family member 1B1
Type:Protein
Mol. Mass.:76468.06
Organism:Homo sapiens (Human)
Description:Q9Y6L6
Residue:691
BDBM50097125
NameBDBM50097125
Synonyms:2-Hydroxy-5-((4-((2-pyridinylamino)sulfonyl)phenyl)azo)benzoic acid 4-(Pyridyl-2-amidosulfonyl)-3'-carboxy-4'-hydroxyazobenzene 5-(4-(2-Pyridylsulfamoyl)phenylazo)-2-hydroxybenzoic acid Salazosulfapyridine Sulfasalazine
TypeSmall organic molecule
Emp. Form.C18H14N4O5S
Mol. Mass.398.393
SMILESOC(=O)c1cc(ccc1O)N=Nc1ccc(cc1)S(=O)(=O)Nc1ccccn1