Reaction Details
TargetSolute carrier organic anion transporter family member 2B1
LigandBDBM17638
Substrate/Competitorn/a
Meas. Tech.ChEMBL_860288 (CHEMBL2169434)
IC50 140000±n/a nM
Citation Karlgren, MVildhede, ANorinder, UWisniewski, JRKimoto, ELai, YHaglund, UArtursson, P Classification of inhibitors of hepatic organic anion transporting polypeptides (OATPs): influence of protein expression on drug-drug interactions. J Med Chem55:4740-63 (2012) 
 
Solute carrier organic anion transporter family member 2B1
Name:Solute carrier organic anion transporter family member 2B1
Type:PROTEIN
Mol. Mass.:76729.07
Organism:Homo sapiens (Human)
Description:ChEMBL_1488531
Residue:709
BDBM17638
NameBDBM17638
Synonyms:2-{1-[(4-chlorophenyl)carbonyl]-5-methoxy-2-methyl-1H-indol-3-yl}acetic acid Indocin US11478464, Compound Indomethacin US9271961, Indomethacin | indometacin
TypeSmall organic molecule
Emp. Form.C19H16ClNO4
Mol. Mass.357.788
SMILESCOc1ccc2n(C(=O)c3ccc(Cl)cc3)c(C)c(CC(O)=O)c2c1