Reaction Details
TargetSolute carrier organic anion transporter family member 2B1
LigandBDBM5446
Substrate/Competitorn/a
Meas. Tech.ChEMBL_860288 (CHEMBL2169434)
IC50 550±n/a nM
Citation Karlgren, MVildhede, ANorinder, UWisniewski, JRKimoto, ELai, YHaglund, UArtursson, P Classification of inhibitors of hepatic organic anion transporting polypeptides (OATPs): influence of protein expression on drug-drug interactions. J Med Chem55:4740-63 (2012) 
 
Solute carrier organic anion transporter family member 2B1
Name:Solute carrier organic anion transporter family member 2B1
Type:PROTEIN
Mol. Mass.:76729.07
Organism:Homo sapiens (Human)
Description:ChEMBL_1488531
Residue:709
BDBM5446
NameBDBM5446
Synonyms:CHEMBL553 Erlotinib N-(3-Ethynylphenyl)-6,7-bis(2-methoxyethoxy)-4-quinazolinamine Monohydrochloride OSI-774 US10189853, erlotinib US11524945, Compound Erlotinib US9730934, Erlotinib cid_176870
TypeSmall organic molecule
Emp. Form.C22H23N3O4
Mol. Mass.393.4357
SMILESCOCCOc1cc2ncnc(Nc3cccc(c3)C#C)c2cc1OCCOC