Reaction Details
TargetSolute carrier organic anion transporter family member 1B1
LigandBDBM50013920
Substrate/Competitorn/a
Meas. Tech.ChEMBL_860286 (CHEMBL2169432)
Ki 4300±n/a nM
Citation Karlgren, MVildhede, ANorinder, UWisniewski, JRKimoto, ELai, YHaglund, UArtursson, P Classification of inhibitors of hepatic organic anion transporting polypeptides (OATPs): influence of protein expression on drug-drug interactions. J Med Chem55:4740-63 (2012) 
 
Solute carrier organic anion transporter family member 1B1
Name:Solute carrier organic anion transporter family member 1B1
Type:Protein
Mol. Mass.:76468.06
Organism:Homo sapiens (Human)
Description:Q9Y6L6
Residue:691
BDBM50013920
NameBDBM50013920
Synonyms:3-[(R)-{3-[(E)-2-(7-Chloro-quinolin-2-yl)-vinyl]-phenyl}-(2-dimethylcarbamoyl-ethylsulfanyl)-methylsulfanyl]-propionic acid CHEMBL280481 VERLUKAST
TypeSmall organic molecule
Emp. Form.C26H27ClN2O3S2
Mol. Mass.515.087
SMILESCN(C)C(=O)CCS[C@H](SCCC(O)=O)c1cccc(\C=C\c2ccc3ccc(Cl)cc3n2)c1