Reaction Details
TargetPhosphatidylinositol 4,5-bisphosphate 3-kinase catalytic subunit beta isoform
LigandBDBM50394846
Substrate/Competitorn/a
Meas. Tech.ChEMBL_860487 (CHEMBL2166656)
Ki 5±n/a nM
Citation Smith, ALD'Angelo, NDBo, YYBooker, SKCee, VJHerberich, BHong, FTJackson, CLLanman, BALiu, LNishimura, NPettus, LHReed, ABTadesse, STamayo, NAWurz, RPYang, KAndrews, KLWhittington, DAMcCarter, JDMiguel, TSZalameda, LJiang, JSubramanian, RMullady, ELCaenepeel, SFreeman, DJWang, LZhang, NWu, THughes, PENorman, MH Structure-based design of a novel series of potent, selective inhibitors of the class I phosphatidylinositol 3-kinases. J Med Chem55:5188-219 (2012) 
 
Phosphatidylinositol 4,5-bisphosphate 3-kinase catalytic subunit beta isoform
Name:Phosphatidylinositol 4,5-bisphosphate 3-kinase catalytic subunit beta isoform
Type:Enzyme Subunit
Mol. Mass.:122769.00
Organism:Homo sapiens (Human)
Description:P42338
Residue:1070
BDBM50394846
NameBDBM50394846
Synonyms:CHEMBL2165017 | US8772480, 35
TypeSmall organic molecule
Emp. Form.C21H27N9O3S
Mol. Mass.485.563
SMILESCOc1ccc(Nc2ncc(CN3CCN(CC3)S(C)(=O)=O)cc2-c2nc(C)nc(N)n2)cn1