Reaction Details
TargetD(2) dopamine receptor
LigandBDBM50131922
Substrate/Competitorn/a
Meas. Tech.ChEMBL_860683 (CHEMBL2168000)
Ki 37.4±n/a nM
Citation Newman, AHBeuming, TBanala, AKDonthamsetti, PPongetti, KLaBounty, ALevy, BCao, JMichino, MLuedtke, RRJavitch, JAShi, L Molecular determinants of selectivity and efficacy at the dopamine D3 receptor. J Med Chem55:6689-99 (2012) 
 
D(2) dopamine receptor
Name:D(2) dopamine receptor
Type:Cell-surface receptors
Mol. Mass.:50647.10
Organism:Homo sapiens (Human)
Description:P14416
Residue:443
BDBM50131922
NameBDBM50131922
Synonyms:1H-Indole-2-carboxylic acid {4-[4-(2-methoxy-phenyl)-piperazin-1-yl]-butyl}-amide N-(4-(4-(2-methoxyphenyl)piperazin-1-yl)butyl)-1H-indole-2-carboxamide
TypeSmall organic molecule
Emp. Form.C24H30N4O2
Mol. Mass.406.5206
SMILESCOc1ccccc1N1CCN(CCCCNC(=O)c2cc3ccccc3[nH]2)CC1