Reaction Details
TargetPlatelet glycoprotein 4
LigandBDBM50395018
Substrate/Competitorn/a
Meas. Tech.ChEMBL_858884 (CHEMBL2167930)
IC50>10000±n/a nM
Citation Proulx, CPicard, ÉBoeglin, DPohankova, PChemtob, SOng, HLubell, WD Azapeptide analogues of the growth hormone releasing peptide 6 as cluster of differentiation 36 receptor ligands with reduced affinity for the growth hormone secretagogue receptor 1a. J Med Chem55:6502-11 (2012) 
 
Platelet glycoprotein 4
Name:Platelet glycoprotein 4
Type:PROTEIN
Mol. Mass.:52740.95
Organism:Rattus norvegicus
Description:ChEMBL_858884
Residue:472
BDBM50395018
NameBDBM50395018
Synonyms:CHEMBL2163450 | US9708370, 55 CP-2B(iv)
TypeSmall organic molecule
Emp. Form.C40H56N12O6
Mol. Mass.800.9494
SMILESCC(C)CN(NC(=O)[C@@H](C)NC(=O)[C@@H](N)Cc1cnc[nH]1)C(=O)N[C@@H](Cc1c[nH]c2ccccc12)C(=O)N[C@H](Cc1ccccc1)C(=O)N[C@@H](CCCCN)C(N)=O