Reaction Details
TargetMu-type opioid receptor
LigandBDBM50395065
Substrate/Competitorn/a
Meas. Tech.ChEMBL_859251 (CHEMBL2166336)
Ki 7.1±n/a nM
Citation Wang, YXing, YLiu, XJi, HKai, MChen, ZYu, JZhao, DRen, HWang, R A new class of highly potent and selective endomorphin-1 analogues containinga-methylene-ß-aminopropanoic acids (map). J Med Chem55:6224-36 (2012) 
 
Mu-type opioid receptor
Name:Mu-type opioid receptor
Type:G Protein-Coupled Receptor (GPCR)
Mol. Mass.:44789.51
Organism:Homo sapiens (Human)
Description:P35372
Residue:400
BDBM50395065
NameBDBM50395065
Synonyms:CHEMBL2163911
TypeSmall organic molecule
Emp. Form.C35H37ClN6O5
Mol. Mass.657.158
SMILESN[C@@H](Cc1ccc(O)cc1)C(=O)N1CCC[C@H]1C(=O)N[C@@H](Cc1c[nH]c2ccccc12)C(=O)N[C@H](C(=C)C(N)=O)c1ccc(Cl)cc1