Reaction Details
TargetEgl nine homolog 1
LigandBDBM50395077
Substrate/Competitorn/a
Meas. Tech.ChEMBL_859438 (CHEMBL2167516)
IC50>100000±n/a nM
Citation Rose, NRWoon, ECTumber, AWalport, LJChowdhury, RLi, XSKing, ONLejeune, CNg, SSKrojer, TChan, MCRydzik, AMHopkinson, RJChe, KHDaniel, MStrain-Damerell, CGileadi, CKochan, GLeung, IKDunford, JYeoh, KKRatcliffe, PJBurgess-Brown, Nvon Delft, FMuller, SMarsden, BBrennan, PEMcDonough, MAOppermann, UKlose, RJSchofield, CJKawamura, A Plant growth regulator daminozide is a selective inhibitor of human KDM2/7 histone demethylases. J Med Chem55:6639-43 (2012) 
 
Egl nine homolog 1
Name:Egl nine homolog 1
Type:Protein
Mol. Mass.:46035.59
Organism:Homo sapiens (Human)
Description:Q9GZT9
Residue:426
BDBM50395077
NameBDBM50395077
Synonyms:CHEMBL2164250
TypeSmall organic molecule
Emp. Form.C8H18N4O2
Mol. Mass.202.2541
SMILESCN(C)NC(=O)CCC(=O)NN(C)C