Reaction Details
TargetLysine-specific demethylase 2A
LigandBDBM50395077
Substrate/Competitorn/a
Meas. Tech.ChEMBL_859444 (CHEMBL2167522)
IC50>100000±n/a nM
Citation Rose, NRWoon, ECTumber, AWalport, LJChowdhury, RLi, XSKing, ONLejeune, CNg, SSKrojer, TChan, MCRydzik, AMHopkinson, RJChe, KHDaniel, MStrain-Damerell, CGileadi, CKochan, GLeung, IKDunford, JYeoh, KKRatcliffe, PJBurgess-Brown, Nvon Delft, FMuller, SMarsden, BBrennan, PEMcDonough, MAOppermann, UKlose, RJSchofield, CJKawamura, A Plant growth regulator daminozide is a selective inhibitor of human KDM2/7 histone demethylases. J Med Chem55:6639-43 (2012) 
 
Lysine-specific demethylase 2A
Name:Lysine-specific demethylase 2A
Type:Enzyme Catalytic Domain
Mol. Mass.:132809.04
Organism:Homo sapiens (Human)
Description:n/a
Residue:1162
BDBM50395077
NameBDBM50395077
Synonyms:CHEMBL2164250
TypeSmall organic molecule
Emp. Form.C8H18N4O2
Mol. Mass.202.2541
SMILESCN(C)NC(=O)CCC(=O)NN(C)C