Reaction Details
TargetLysine-specific demethylase 2A
LigandBDBM50395080
Substrate/Competitorn/a
Meas. Tech.ChEMBL_859444 (CHEMBL2167522)
IC50 9100±n/a nM
Citation Rose, NRWoon, ECTumber, AWalport, LJChowdhury, RLi, XSKing, ONLejeune, CNg, SSKrojer, TChan, MCRydzik, AMHopkinson, RJChe, KHDaniel, MStrain-Damerell, CGileadi, CKochan, GLeung, IKDunford, JYeoh, KKRatcliffe, PJBurgess-Brown, Nvon Delft, FMuller, SMarsden, BBrennan, PEMcDonough, MAOppermann, UKlose, RJSchofield, CJKawamura, A Plant growth regulator daminozide is a selective inhibitor of human KDM2/7 histone demethylases. J Med Chem55:6639-43 (2012) 
 
Lysine-specific demethylase 2A
Name:Lysine-specific demethylase 2A
Type:Enzyme Catalytic Domain
Mol. Mass.:132809.04
Organism:Homo sapiens (Human)
Description:n/a
Residue:1162
BDBM50395080
NameBDBM50395080
Synonyms:CHEMBL2164249
TypeSmall organic molecule
Emp. Form.C6H11NO4
Mol. Mass.161.1558
SMILESCN(C)OC(=O)CCC(O)=O