Reaction Details
TargetGamma-butyrobetaine dioxygenase
LigandBDBM50197063
Substrate/Competitorn/a
Meas. Tech.ChEMBL_859436 (CHEMBL2167514)
IC50>100000±n/a nM
Citation Rose, NRWoon, ECTumber, AWalport, LJChowdhury, RLi, XSKing, ONLejeune, CNg, SSKrojer, TChan, MCRydzik, AMHopkinson, RJChe, KHDaniel, MStrain-Damerell, CGileadi, CKochan, GLeung, IKDunford, JYeoh, KKRatcliffe, PJBurgess-Brown, Nvon Delft, FMuller, SMarsden, BBrennan, PEMcDonough, MAOppermann, UKlose, RJSchofield, CJKawamura, A Plant growth regulator daminozide is a selective inhibitor of human KDM2/7 histone demethylases. J Med Chem55:6639-43 (2012) 
 
Gamma-butyrobetaine dioxygenase
Name:Gamma-butyrobetaine dioxygenase
Type:PROTEIN
Mol. Mass.:44715.93
Organism:Homo sapiens (Human)
Description:ChEMBL_1434107
Residue:387
BDBM50197063
NameBDBM50197063
Synonyms:4,6-dioxoheptanoic acid succinylacetone
TypeSmall organic molecule
Emp. Form.C7H10O4
Mol. Mass.158.1519
SMILESCC(=O)CC(=O)CCC(O)=O