Reaction Details
TargetLysine-specific demethylase 5C
LigandBDBM50197063
Substrate/Competitorn/a
Meas. Tech.ChEMBL_859440 (CHEMBL2167518)
IC50 4500±n/a nM
Citation Rose, NRWoon, ECTumber, AWalport, LJChowdhury, RLi, XSKing, ONLejeune, CNg, SSKrojer, TChan, MCRydzik, AMHopkinson, RJChe, KHDaniel, MStrain-Damerell, CGileadi, CKochan, GLeung, IKDunford, JYeoh, KKRatcliffe, PJBurgess-Brown, Nvon Delft, FMuller, SMarsden, BBrennan, PEMcDonough, MAOppermann, UKlose, RJSchofield, CJKawamura, A Plant growth regulator daminozide is a selective inhibitor of human KDM2/7 histone demethylases. J Med Chem55:6639-43 (2012) 
 
Lysine-specific demethylase 5C
Name:Lysine-specific demethylase 5C
Type:PROTEIN
Mol. Mass.:175691.17
Organism:Homo sapiens (Human)
Description:P41229
Residue:1560
BDBM50197063
NameBDBM50197063
Synonyms:4,6-dioxoheptanoic acid succinylacetone
TypeSmall organic molecule
Emp. Form.C7H10O4
Mol. Mass.158.1519
SMILESCC(=O)CC(=O)CCC(O)=O