Reaction Details
TargetHistone lysine demethylase PHF8
LigandBDBM50129197
Substrate/Competitorn/a
Meas. Tech.ChEMBL_859445 (CHEMBL2167523)
IC50 1700±n/a nM
Citation Rose, NRWoon, ECTumber, AWalport, LJChowdhury, RLi, XSKing, ONLejeune, CNg, SSKrojer, TChan, MCRydzik, AMHopkinson, RJChe, KHDaniel, MStrain-Damerell, CGileadi, CKochan, GLeung, IKDunford, JYeoh, KKRatcliffe, PJBurgess-Brown, Nvon Delft, FMuller, SMarsden, BBrennan, PEMcDonough, MAOppermann, UKlose, RJSchofield, CJKawamura, A Plant growth regulator daminozide is a selective inhibitor of human KDM2/7 histone demethylases. J Med Chem55:6639-43 (2012) 
 
Histone lysine demethylase PHF8
Name:Histone lysine demethylase PHF8
Type:Protein
Mol. Mass.:117889.91
Organism:Homo sapiens (Human)
Description:Q9UPP1
Residue:1060
BDBM50129197
NameBDBM50129197
Synonyms:4-(Hydroxyamino)-4-oxobutanoic acid N-Hydroxy-succinamic acid
TypeSmall organic molecule
Emp. Form.C4H7NO4
Mol. Mass.133.1027
SMILESONC(=O)CCC(O)=O